Reaction Details
TargetCysteinyl leukotriene receptor 1
LigandBDBM50009075
Substrate/Competitorn/a
Meas. Tech.ChEBML_52358
Ki 0.300000±n/a nM
Citation Huang, FCGalemmo, RAPoli, GBLearn, KSMorrissette, MMJohnson, WHDankulich, WPCampbell, HFCarnathan, GWVanInwegen, RG Development of a novel series of (2-quinolinylmethoxy)phenyl-containing compounds as high-affinity leukotriene D4 receptor antagonists. 4. Addition of chromone moiety enhances leukotriene D4 receptor binding affinity. J Med Chem34:1704-7 (1991) Cysteinyl leukotriene receptor 1
Name:Cysteinyl leukotriene receptor 1
Type:Enzyme Catalytic Domain
Mol. Mass.:39007.58
Organism:GUINEA PIG
Description:Leukotriene D4 0 GUINEA PIG::Q2NNR5
Residue:340
BDBM50009075
NameBDBM50009075
Synonyms:CHEMBL22033 ICI-198615 [1-(4-Benzenesulfonylaminocarbonyl-2-methoxy-benzyl)-1H-indazol-6-yl]-carbamic acid cyclopentyl ester [1-(4-Benzenesulfonylaminocarbonyl-2-methoxy-benzyl)-1H-indazol-6-yl]-carbamic acid cyclopentyl ester(ICI 198, 615) | [1-(4-Benzenesulfonylaminocarbonyl-2-methoxy-benzyl)-1H-indazol-6-yl]-carbamic acid cyclopentyl ester(ICI 198615)
TypeSmall organic molecule
Emp. Form.C28H28N4O6S
Mol. Mass.548.61
SMILESCOc1cc(ccc1Cn1ncc2ccc(NC(=O)OC3CCCC3)cc12)C(=O)NS(=O)(=O)c1ccccc1