Reaction Details
TargetCysteinyl leukotriene receptor 1
LigandBDBM50291859
Substrate/Competitorn/a
Meas. Tech.ChEBML_52358
Ki 13±n/a nM
Citation Huang, FCGalemmo, RAPoli, GBLearn, KSMorrissette, MMJohnson, WHDankulich, WPCampbell, HFCarnathan, GWVanInwegen, RG Development of a novel series of (2-quinolinylmethoxy)phenyl-containing compounds as high-affinity leukotriene D4 receptor antagonists. 4. Addition of chromone moiety enhances leukotriene D4 receptor binding affinity. J Med Chem34:1704-7 (1991) Cysteinyl leukotriene receptor 1
Name:Cysteinyl leukotriene receptor 1
Type:Enzyme Catalytic Domain
Mol. Mass.:39007.58
Organism:GUINEA PIG
Description:Leukotriene D4 0 GUINEA PIG::Q2NNR5
Residue:340
BDBM50291859
NameBDBM50291859
Synonyms:4-Oxo-8-[4-(quinolin-2-ylmethoxy)-phenoxymethyl]-chroman-2-carboxylic acid | CHEMBL45965
TypeSmall organic molecule
Emp. Form.C27H21NO6
Mol. Mass.455.4587
SMILESOC(=O)C1CC(=O)c2cccc(COc3ccc(OCc4ccc5ccccc5n4)cc3)c2O1