Reaction Details
TargetG-protein coupled receptor 35
LigandBDBM50259844
Substrate/Competitorn/a
Meas. Tech.ChEMBL_1691965 (CHEMBL4042614)
IC50 750±n/a nM
Citation Wei, LWang, JZhang, XWang, PZhao, YLi, JHou, TQu, LShi, LLiang, XFang, Y Discovery of 2H-Chromen-2-one Derivatives as G Protein-Coupled Receptor-35 Agonists. J Med Chem60:362-372 (2017) 
 
G-protein coupled receptor 35
Name:G-protein coupled receptor 35
Type:Enzyme Catalytic Domain
Mol. Mass.:34085.57
Organism:Homo sapiens (Human)
Description:gi_33695097
Residue:309
BDBM50259844
NameBDBM50259844
Synonyms:CHEMBL4105535
TypeSmall organic molecule
Emp. Form.C11H6Br2O5
Mol. Mass.377.97
SMILESCOc1c(Br)cc2cc(C(O)=O)c(=O)oc2c1Br