Reaction Details
TargetFibroblast growth factor receptor 2
LigandBDBM50403060
Substrate/Competitorn/a
Meas. Tech.ChEBML_1692888
IC50 2.3±n/a nM
Citation Li, XGuise, CPTaghipouran, RYosaatmadja, YAshoorzadeh, APaik, WKSquire, CJJiang, SLuo, JXu, YTu, ZCLu, XRen, XPatterson, AVSmaill, JBDing, K 2-Oxo-3, 4-dihydropyrimido[4, 5-d]pyrimidinyl derivatives as new irreversible pan fibroblast growth factor receptor (FGFR) inhibitors. Eur J Med Chem135:531-543 (2017) 
 
Fibroblast growth factor receptor 2
Name:Fibroblast growth factor receptor 2
Type:Enzyme
Mol. Mass.:92015.45
Organism:Homo sapiens (Human)
Description:P21802
Residue:821
BDBM50403060
NameBDBM50403060
Synonyms:CHEMBL2216830
TypeSmall organic molecule
Emp. Form.C32H39Cl2N7O4
Mol. Mass.656.603
SMILESCCN(CC)CCCCNc1ncc2CN(C(=O)N(Cc3cccc(NC(=O)C=C)c3)c2n1)c1c(Cl)c(OC)cc(OC)c1Cl