Reaction Details
TargetFibroblast growth factor receptor 1
LigandBDBM50260191
Substrate/Competitorn/a
Meas. Tech.ChEBML_1692887
IC50 1.2±n/a nM
Citation Li, XGuise, CPTaghipouran, RYosaatmadja, YAshoorzadeh, APaik, WKSquire, CJJiang, SLuo, JXu, YTu, ZCLu, XRen, XPatterson, AVSmaill, JBDing, K 2-Oxo-3, 4-dihydropyrimido[4, 5-d]pyrimidinyl derivatives as new irreversible pan fibroblast growth factor receptor (FGFR) inhibitors. Eur J Med Chem135:531-543 (2017) 
 
Fibroblast growth factor receptor 1
Name:Fibroblast growth factor receptor 1
Type:Receptor
Mol. Mass.:91861.70
Organism:Homo sapiens (Human)
Description:P11362
Residue:822
BDBM50260191
NameBDBM50260191
Synonyms:CHEMBL4103795
TypeSmall organic molecule
Emp. Form.C32H37Cl2N7O4
Mol. Mass.654.587
SMILESCOc1cc(OC)c(Cl)c(N2Cc3cnc(Nc4cccc(C)c4)nc3N(C3CCN(CC3)C(=O)\C=C\CN(C)C)C2=O)c1Cl