Reaction Details
TargetFibroblast growth factor receptor 1
LigandBDBM50260192
Substrate/Competitorn/a
Meas. Tech.ChEBML_1692887
IC50 1.1±n/a nM
Citation Li, XGuise, CPTaghipouran, RYosaatmadja, YAshoorzadeh, APaik, WKSquire, CJJiang, SLuo, JXu, YTu, ZCLu, XRen, XPatterson, AVSmaill, JBDing, K 2-Oxo-3, 4-dihydropyrimido[4, 5-d]pyrimidinyl derivatives as new irreversible pan fibroblast growth factor receptor (FGFR) inhibitors. Eur J Med Chem135:531-543 (2017) 
 
Fibroblast growth factor receptor 1
Name:Fibroblast growth factor receptor 1
Type:Receptor
Mol. Mass.:91861.70
Organism:Homo sapiens (Human)
Description:P11362
Residue:822
BDBM50260192
NameBDBM50260192
Synonyms:CHEMBL4088313
TypeSmall organic molecule
Emp. Form.C31H41Cl2N7O4
Mol. Mass.646.608
SMILESCOc1cc(OC)c(Cl)c(N2Cc3cnc(NC4CCCCC4)nc3N(C3CCN(CC3)C(=O)\C=C\CN(C)C)C2=O)c1Cl