Reaction Details
TargetFibroblast growth factor receptor 1
LigandBDBM50260205
Substrate/Competitorn/a
Meas. Tech.ChEBML_1692887
IC50 2.3±n/a nM
Citation Li, XGuise, CPTaghipouran, RYosaatmadja, YAshoorzadeh, APaik, WKSquire, CJJiang, SLuo, JXu, YTu, ZCLu, XRen, XPatterson, AVSmaill, JBDing, K 2-Oxo-3, 4-dihydropyrimido[4, 5-d]pyrimidinyl derivatives as new irreversible pan fibroblast growth factor receptor (FGFR) inhibitors. Eur J Med Chem135:531-543 (2017) 
 
Fibroblast growth factor receptor 1
Name:Fibroblast growth factor receptor 1
Type:Receptor
Mol. Mass.:91861.70
Organism:Homo sapiens (Human)
Description:P11362
Residue:822
BDBM50260205
NameBDBM50260205
Synonyms:CHEMBL4061908
TypeSmall organic molecule
Emp. Form.C25H31Cl2N7O4
Mol. Mass.564.464
SMILESCNc1ncc2CN(C(=O)N([C@H]3CCN(C3)C(=O)\C=C\CN(C)C)c2n1)c1c(Cl)c(OC)cc(OC)c1Cl