Reaction Details
TargetEstrogen receptor
LigandBDBM50261552
Substrate/Competitorn/a
Meas. Tech.ChEMBL_1696128 (CHEMBL4047018)
IC50 3510±n/a nM
Citation Torikai, KKoga, RLiu, XUmehara, KKitano, TWatanabe, KOishi, TNoguchi, HShimohigashi, Y Design and synthesis of benzoacridines as estrogenic and anti-estrogenic agents. Bioorg Med Chem25:5216-5237 (2017) 
 
Estrogen receptor
Name:Estrogen receptor
Type:Protein
Mol. Mass.:66230.44
Organism:Homo sapiens (Human)
Description:P03372
Residue:595
BDBM50261552
NameBDBM50261552
Synonyms:CHEMBL4066690
TypeSmall organic molecule
Emp. Form.C24H15ClF3N
Mol. Mass.409.831
SMILESCl.FC(F)(F)c1ccc2cc3nc4ccccc4c(-c4ccccc4)c3cc2c1