Reaction Details
TargetEstrogen receptor
LigandBDBM50261551
Substrate/Competitorn/a
Meas. Tech.ChEMBL_1696128 (CHEMBL4047018)
IC50 915±n/a nM
Citation Torikai, KKoga, RLiu, XUmehara, KKitano, TWatanabe, KOishi, TNoguchi, HShimohigashi, Y Design and synthesis of benzoacridines as estrogenic and anti-estrogenic agents. Bioorg Med Chem25:5216-5237 (2017) 
 
Estrogen receptor
Name:Estrogen receptor
Type:Protein
Mol. Mass.:66230.44
Organism:Homo sapiens (Human)
Description:P03372
Residue:595
BDBM50261551
NameBDBM50261551
Synonyms:CHEMBL4094003
TypeSmall organic molecule
Emp. Form.C23H16ClN
Mol. Mass.341.833
SMILESCl.c1ccc(cc1)-c1c2ccccc2nc2cc3ccccc3cc12