Reaction Details
TargetEstrogen receptor
LigandBDBM50261554
Substrate/Competitorn/a
Meas. Tech.ChEBML_1696131
IC50 1083±n/a nM
Citation Torikai, KKoga, RLiu, XUmehara, KKitano, TWatanabe, KOishi, TNoguchi, HShimohigashi, Y Design and synthesis of benzoacridines as estrogenic and anti-estrogenic agents. Bioorg Med Chem25:5216-5237 (2017) 
 
Estrogen receptor
Name:Estrogen receptor
Type:Protein
Mol. Mass.:66230.44
Organism:Homo sapiens (Human)
Description:P03372
Residue:595
BDBM50261554
NameBDBM50261554
Synonyms:CHEMBL4092300
TypeSmall organic molecule
Emp. Form.C23H16ClNO
Mol. Mass.357.832
SMILESCl.Oc1cccc2c(-c3ccccc3)c3cc4ccccc4cc3nc12