Reaction Details
TargetEstrogen receptor
LigandBDBM50261556
Substrate/Competitorn/a
Meas. Tech.ChEBML_1696131
IC50 1654±n/a nM
Citation Torikai, KKoga, RLiu, XUmehara, KKitano, TWatanabe, KOishi, TNoguchi, HShimohigashi, Y Design and synthesis of benzoacridines as estrogenic and anti-estrogenic agents. Bioorg Med Chem25:5216-5237 (2017) 
 
Estrogen receptor
Name:Estrogen receptor
Type:Protein
Mol. Mass.:66230.44
Organism:Homo sapiens (Human)
Description:P03372
Residue:595
BDBM50261556
NameBDBM50261556
Synonyms:CHEMBL4105062
TypeSmall organic molecule
Emp. Form.C23H15Cl2N
Mol. Mass.376.278
SMILESCl.Clc1ccc2c(-c3ccccc3)c3cc4ccccc4cc3nc2c1