Reaction Details
TargetEstrogen receptor beta
LigandBDBM50261553
Substrate/Competitorn/a
Meas. Tech.ChEBML_1696129
IC50 154±n/a nM
Citation Torikai, KKoga, RLiu, XUmehara, KKitano, TWatanabe, KOishi, TNoguchi, HShimohigashi, Y Design and synthesis of benzoacridines as estrogenic and anti-estrogenic agents. Bioorg Med Chem25:5216-5237 (2017) 
 
Estrogen receptor beta
Name:Estrogen receptor beta
Type:Protein
Mol. Mass.:59238.43
Organism:Homo sapiens (Human)
Description:Q92731
Residue:530
BDBM50261553
NameBDBM50261553
Synonyms:CHEMBL4087989
TypeSmall organic molecule
Emp. Form.C23H16ClNO
Mol. Mass.357.832
SMILESCl.Oc1ccc2cc3nc4ccccc4c(-c4ccccc4)c3cc2c1