Reaction Details
TargetEstrogen receptor beta
LigandBDBM50261556
Substrate/Competitorn/a
Meas. Tech.ChEBML_1696129
IC50 1977±n/a nM
Citation Torikai, KKoga, RLiu, XUmehara, KKitano, TWatanabe, KOishi, TNoguchi, HShimohigashi, Y Design and synthesis of benzoacridines as estrogenic and anti-estrogenic agents. Bioorg Med Chem25:5216-5237 (2017) 
 
Estrogen receptor beta
Name:Estrogen receptor beta
Type:Protein
Mol. Mass.:59238.43
Organism:Homo sapiens (Human)
Description:Q92731
Residue:530
BDBM50261556
NameBDBM50261556
Synonyms:CHEMBL4105062
TypeSmall organic molecule
Emp. Form.C23H15Cl2N
Mol. Mass.376.278
SMILESCl.Clc1ccc2c(-c3ccccc3)c3cc4ccccc4cc3nc2c1