Reaction Details
TargetEstrogen receptor beta
LigandBDBM50261557
Substrate/Competitorn/a
Meas. Tech.ChEBML_1696129
IC50 2525±n/a nM
Citation Torikai, KKoga, RLiu, XUmehara, KKitano, TWatanabe, KOishi, TNoguchi, HShimohigashi, Y Design and synthesis of benzoacridines as estrogenic and anti-estrogenic agents. Bioorg Med Chem25:5216-5237 (2017) 
 
Estrogen receptor beta
Name:Estrogen receptor beta
Type:Protein
Mol. Mass.:59238.43
Organism:Homo sapiens (Human)
Description:Q92731
Residue:530
BDBM50261557
NameBDBM50261557
Synonyms:CHEMBL4071813
TypeSmall organic molecule
Emp. Form.C23H15Cl2N
Mol. Mass.376.278
SMILESCl.Clc1c2ccccc2cc2c(-c3ccccc3)c3ccccc3nc12