Reaction Details
TargetEstrogen receptor
LigandBDBM50261558
Substrate/Competitorn/a
Meas. Tech.ChEBML_1696131
IC50 2650±n/a nM
Citation Torikai, KKoga, RLiu, XUmehara, KKitano, TWatanabe, KOishi, TNoguchi, HShimohigashi, Y Design and synthesis of benzoacridines as estrogenic and anti-estrogenic agents. Bioorg Med Chem25:5216-5237 (2017) 
 
Estrogen receptor
Name:Estrogen receptor
Type:Protein
Mol. Mass.:66230.44
Organism:Homo sapiens (Human)
Description:P03372
Residue:595
BDBM50261558
NameBDBM50261558
Synonyms:CHEMBL4071506
TypeSmall organic molecule
Emp. Form.C24H15ClF3N
Mol. Mass.409.831
SMILESCl.FC(F)(F)c1cccc2c(-c3ccccc3)c3cc4ccccc4cc3nc12