Reaction Details
TargetEstrogen receptor
LigandBDBM50261555
Substrate/Competitorn/a
Meas. Tech.ChEBML_1696131
IC50 294±n/a nM
Citation Torikai, KKoga, RLiu, XUmehara, KKitano, TWatanabe, KOishi, TNoguchi, HShimohigashi, Y Design and synthesis of benzoacridines as estrogenic and anti-estrogenic agents. Bioorg Med Chem25:5216-5237 (2017) 
 
Estrogen receptor
Name:Estrogen receptor
Type:Protein
Mol. Mass.:66230.44
Organism:Homo sapiens (Human)
Description:P03372
Residue:595
BDBM50261555
NameBDBM50261555
Synonyms:CHEMBL4088694
TypeSmall organic molecule
Emp. Form.C23H16ClNO
Mol. Mass.357.832
SMILESCl.Oc1ccc2c(-c3ccccc3)c3cc4ccccc4cc3nc2c1