Reaction Details
TargetEstrogen receptor beta
LigandBDBM50261551
Substrate/Competitorn/a
Meas. Tech.ChEBML_1696129
IC50 1690±n/a nM
Citation Torikai, KKoga, RLiu, XUmehara, KKitano, TWatanabe, KOishi, TNoguchi, HShimohigashi, Y Design and synthesis of benzoacridines as estrogenic and anti-estrogenic agents. Bioorg Med Chem25:5216-5237 (2017) 
 
Estrogen receptor beta
Name:Estrogen receptor beta
Type:Protein
Mol. Mass.:59238.43
Organism:Homo sapiens (Human)
Description:Q92731
Residue:530
BDBM50261551
NameBDBM50261551
Synonyms:CHEMBL4094003
TypeSmall organic molecule
Emp. Form.C23H16ClN
Mol. Mass.341.833
SMILESCl.c1ccc(cc1)-c1c2ccccc2nc2cc3ccccc3cc12