Reaction Details
TargetEstrogen receptor beta
LigandBDBM50261555
Substrate/Competitorn/a
Meas. Tech.ChEBML_1696129
IC50 306±n/a nM
Citation Torikai, KKoga, RLiu, XUmehara, KKitano, TWatanabe, KOishi, TNoguchi, HShimohigashi, Y Design and synthesis of benzoacridines as estrogenic and anti-estrogenic agents. Bioorg Med Chem25:5216-5237 (2017) 
 
Estrogen receptor beta
Name:Estrogen receptor beta
Type:Protein
Mol. Mass.:59238.43
Organism:Homo sapiens (Human)
Description:Q92731
Residue:530
BDBM50261555
NameBDBM50261555
Synonyms:CHEMBL4088694
TypeSmall organic molecule
Emp. Form.C23H16ClNO
Mol. Mass.357.832
SMILESCl.Oc1ccc2c(-c3ccccc3)c3cc4ccccc4cc3nc2c1