Reaction Details
TargetKappa-type opioid receptor
LigandBDBM50010535
Substrate/Competitorn/a
Meas. Tech.ChEBML_145678
IC50 2.3±n/a nM
Citation Yoshino, HNakazawa, TArakawa, YKaneko, TTsuchiya, YMatsunaga, MAraki, SIkeda, MYamatsu, KTachibana, S Synthesis and structure-activity relationships of dynorphin A-(1-8) amide analogues. J Med Chem33:206-12 (1990) Kappa-type opioid receptor
Name:Kappa-type opioid receptor
Type:G Protein-Coupled Receptor (GPCR)
Mol. Mass.:42648.76
Organism:Homo sapiens (Human)
Description:P41145
Residue:380
BDBM50010535
NameBDBM50010535
Synonyms:2-{5-Guanidino-2-[(5-guanidino-2-{2-[2-(2-{2-[3-(4-hydroxy-phenyl)-2-methylamino-propionylamino]-acetylamino}-acetylamino)-3-phenyl-propionylamino]-4-methyl-pentanoylamino}-pentanoyl)-methyl-amino]-pentanoylamino}-4-methyl-pentanoic acid amide | CHEMBL266035
TypeSmall organic molecule
Emp. Form.C48H77N15O9
Mol. Mass.1008.2201
SMILESCN[C@@H](Cc1ccc(O)cc1)C(=O)NCC(=O)NCC(=O)N[C@H](Cc1ccccc1)C(=O)N[C@@H](CC(C)C)C(=O)N[C@@H](CCCNC(N)=N)C(=O)N(C)[C@@H](CCCNC(N)=N)C(=O)N[C@@H](CC(C)C)C(N)=O