Reaction Details
TargetMu-type opioid receptor
LigandBDBM50010538
Substrate/Competitorn/a
Meas. Tech.ChEMBL_145148 (CHEMBL755952)
Ki 7.2±n/a nM
Citation Yoshino, HNakazawa, TArakawa, YKaneko, TTsuchiya, YMatsunaga, MAraki, SIkeda, MYamatsu, KTachibana, S Synthesis and structure-activity relationships of dynorphin A-(1-8) amide analogues. J Med Chem33:206-12 (1990) Mu-type opioid receptor
Name:Mu-type opioid receptor
Type:Enzyme Catalytic Domain
Mol. Mass.:11165.58
Organism:GUINEA PIG
Description:P97266
Residue:98
BDBM50010538
NameBDBM50010538
Synonyms:2-[2-(2-{2-[2-(2-{2-[2-Amino-3-(4-hydroxy-phenyl)-propionylamino]-acetylamino}-acetylamino)-3-phenyl-propionylamino]-4-methyl-pentanoylamino}-5-guanidino-pentanoylamino)-5-guanidino-pentanoylamino]-3-methyl-pentanoic acid amide | CHEMBL437242
TypeSmall organic molecule
Emp. Form.C46H73N15O9
Mol. Mass.980.1669
SMILESCC[C@H](C)[C@H](NC(=O)[C@H](CCCNC(N)=N)NC(=O)[C@H](CCCNC(N)=N)NC(=O)[C@H](CC(C)C)NC(=O)[C@@H](Cc1ccccc1)NC(=O)CNC(=O)CNC(=O)[C@@H](N)Cc1ccc(O)cc1)C(N)=O