Reaction Details
TargetDelta-type opioid receptor
LigandBDBM50010543
Substrate/Competitorn/a
Meas. Tech.ChEBML_145634
IC50 12±n/a nM
Citation Yoshino, HNakazawa, TArakawa, YKaneko, TTsuchiya, YMatsunaga, MAraki, SIkeda, MYamatsu, KTachibana, S Synthesis and structure-activity relationships of dynorphin A-(1-8) amide analogues. J Med Chem33:206-12 (1990) Delta-type opioid receptor
Name:Delta-type opioid receptor
Type:Enzyme Catalytic Domain
Mol. Mass.:40577.25
Organism:MOUSE
Description:P32300
Residue:372
BDBM50010543
NameBDBM50010543
Synonyms:6-Guanidino-2-{2-[2-(2-{2-[3-(4-hydroxy-phenyl)-2-methylamino-propionylamino]-acetylamino}-acetylamino)-3-phenyl-propionylamino]-4-methyl-pentanoylamino}-hexanoic acid [1-(1-carbamoyl-3-methyl-butylcarbamoyl)-4-guanidino-butyl]-amide | CHEMBL408557
TypeSmall organic molecule
Emp. Form.C48H77N15O9
Mol. Mass.1008.2201
SMILESCN[C@@H](Cc1ccc(O)cc1)C(=O)NCC(=O)NCC(=O)N[C@H](Cc1ccccc1)C(=O)N[C@@H](CC(C)C)C(=O)N[C@@H](CCCCNC(N)=N)C(=O)N[C@@H](CCCNC(N)=N)C(=O)N[C@@H](CC(C)C)C(N)=O