Reaction Details
TargetMu-type opioid receptor
LigandBDBM50010542
Substrate/Competitorn/a
Meas. Tech.ChEMBL_146989 (CHEMBL758065)
IC50 1.3±n/a nM
Citation Yoshino, HNakazawa, TArakawa, YKaneko, TTsuchiya, YMatsunaga, MAraki, SIkeda, MYamatsu, KTachibana, S Synthesis and structure-activity relationships of dynorphin A-(1-8) amide analogues. J Med Chem33:206-12 (1990) Mu-type opioid receptor
Name:Mu-type opioid receptor
Type:Enzyme Catalytic Domain
Mol. Mass.:11165.58
Organism:GUINEA PIG
Description:P97266
Residue:98
BDBM50010542
NameBDBM50010542
Synonyms:2-[5-Guanidino-2-(5-guanidino-2-{2-[2-(2-{2-[3-(4-hydroxy-phenyl)-2-methylamino-propionylamino]-acetylamino}-acetylamino)-3-(4-nitro-phenyl)-propionylamino]-4-methyl-pentanoylamino}-pentanoylamino)-pentanoylamino]-4-methyl-pentanoic acid amide | CHEMBL410611
TypeSmall organic molecule
Emp. Form.C47H74N16O11
Mol. Mass.1039.1911
SMILESCNC(Cc1ccc(O)cc1)C(=O)NCC(=O)NCC(=O)NC(Cc1ccc(cc1)[N+]([O-])=O)C(=O)NC(CC(C)C)C(=O)NC(CCC[N-]C(N)=[NH2+])C(=O)NC(CCC[N-]C(N)=[NH2+])C(=O)NC(CC(C)C)C(N)=O