Reaction Details
TargetDelta-type opioid receptor
LigandBDBM50010541
Substrate/Competitorn/a
Meas. Tech.ChEBML_145634
IC50 210±n/a nM
Citation Yoshino, HNakazawa, TArakawa, YKaneko, TTsuchiya, YMatsunaga, MAraki, SIkeda, MYamatsu, KTachibana, S Synthesis and structure-activity relationships of dynorphin A-(1-8) amide analogues. J Med Chem33:206-12 (1990) Delta-type opioid receptor
Name:Delta-type opioid receptor
Type:Enzyme Catalytic Domain
Mol. Mass.:40577.25
Organism:MOUSE
Description:P32300
Residue:372
BDBM50010541
NameBDBM50010541
Synonyms:2-[5-Guanidino-2-(5-guanidino-2-{2-[2-(2-{2-[3-(4-hydroxy-phenyl)-2-methylamino-propionylamino]-acetylamino}-propionylamino)-3-phenyl-propionylamino]-4-methyl-pentanoylamino}-pentanoylamino)-pentanoylamino]-4-methyl-pentanoic acid amide | CHEMBL217597
TypeSmall organic molecule
Emp. Form.C48H77N15O9
Mol. Mass.1008.2201
SMILESCN[C@@H](Cc1ccc(O)cc1)C(=O)NCC(=O)N[C@H](C)C(=O)N[C@@H](Cc1ccccc1)C(=O)N[C@@H](CC(C)C)C(=O)N[C@@H](CCCNC(N)=N)C(=O)N[C@@H](CCCNC(N)=N)C(=O)N[C@@H](CC(C)C)C(N)=O