Reaction Details
TargetPeptidyl-prolyl cis-trans isomerase FKBP1A
LigandBDBM50263407
Substrate/Competitorn/a
Meas. Tech.ChEBML_1697924
Ki 0.450000±n/a nM
Citation Pomplun, SSippel, CHähle, ATay, DShima, KKlages, AÜnal, CMRieß, BToh, HTHansen, GYoon, HSBracher, APreiser, PRupp, JSteinert, MHausch, F Chemogenomic Profiling of Human and Microbial FK506-Binding Proteins. J Med Chem61:3660-3673 (2018) 
 
Peptidyl-prolyl cis-trans isomerase FKBP1A
Name:Peptidyl-prolyl cis-trans isomerase FKBP1A
Type:Isomerase
Mol. Mass.:11953.09
Organism:Homo sapiens (Human)
Description:P62942
Residue:108
BDBM50263407
NameBDBM50263407
Synonyms:CHEMBL4090599
TypeSmall organic molecule
Emp. Form.C22H25Cl2N3O4S
Mol. Mass.498.423
SMILES[H][C@]12CCC[C@]([H])(N1S(=O)(=O)c1cc(Cl)cc(Cl)c1)C(=O)N(Cc1ccccn1)C[C@@H]2COC