Reaction Details
TargetPeptidyl-prolyl cis-trans isomerase FKBP2
LigandBDBM50263407
Substrate/Competitorn/a
Meas. Tech.ChEBML_1697926
Ki 61±n/a nM
Citation Pomplun, SSippel, CHähle, ATay, DShima, KKlages, AÜnal, CMRieß, BToh, HTHansen, GYoon, HSBracher, APreiser, PRupp, JSteinert, MHausch, F Chemogenomic Profiling of Human and Microbial FK506-Binding Proteins. J Med Chem61:3660-3673 (2018) 
 
Peptidyl-prolyl cis-trans isomerase FKBP2
Name:Peptidyl-prolyl cis-trans isomerase FKBP2
Type:PROTEIN
Mol. Mass.:15655.64
Organism:Homo sapiens
Description:ChEMBL_117554
Residue:142
BDBM50263407
NameBDBM50263407
Synonyms:CHEMBL4090599
TypeSmall organic molecule
Emp. Form.C22H25Cl2N3O4S
Mol. Mass.498.423
SMILES[H][C@]12CCC[C@]([H])(N1S(=O)(=O)c1cc(Cl)cc(Cl)c1)C(=O)N(Cc1ccccn1)C[C@@H]2COC