Reaction Details
TargetCysteine protease
LigandBDBM50263583
Substrate/Competitorn/a
Meas. Tech.ChEBML_1698165
Ki 57±n/a nM
Citation Giroud, MDietzel, UAnselm, LBanner, DKuglstatter, ABenz, JBlanc, JBGaufreteau, DLiu, HLin, XStich, AKuhn, BSchuler, FKaiser, MBrun, RSchirmeister, TKisker, CDiederich, FHaap, W Repurposing a Library of Human Cathepsin L Ligands: Identification of Macrocyclic Lactams as Potent Rhodesain and Trypanosoma brucei Inhibitors. J Med Chem61:3350-3369 (2018) 
 
Cysteine protease
Name:Cysteine protease
Synonyms:Rhodesain
Type:PROTEIN
Mol. Mass.:48425.78
Organism:Trypanosoma brucei rhodesiense
Description:ChEMBL_619861
Residue:450
BDBM50263583
NameBDBM50263583
Synonyms:CHEMBL4091192
TypeSmall organic molecule
Emp. Form.C25H23F3IN3O4
Mol. Mass.613.3675
SMILESFC(F)(F)c1ccc2c(OCCCCOc3ccc(C[C@H](NC2=O)C(=O)NC2(CC2)C#N)cc3I)c1