Reaction Details
TargetCysteine protease
LigandBDBM50263585
Substrate/Competitorn/a
Meas. Tech.ChEBML_1698165
Ki 258±n/a nM
Citation Giroud, MDietzel, UAnselm, LBanner, DKuglstatter, ABenz, JBlanc, JBGaufreteau, DLiu, HLin, XStich, AKuhn, BSchuler, FKaiser, MBrun, RSchirmeister, TKisker, CDiederich, FHaap, W Repurposing a Library of Human Cathepsin L Ligands: Identification of Macrocyclic Lactams as Potent Rhodesain and Trypanosoma brucei Inhibitors. J Med Chem61:3350-3369 (2018) 
 
Cysteine protease
Name:Cysteine protease
Synonyms:Rhodesain
Type:PROTEIN
Mol. Mass.:48425.78
Organism:Trypanosoma brucei rhodesiense
Description:ChEMBL_619861
Residue:450
BDBM50263585
NameBDBM50263585
Synonyms:CHEMBL4065352
TypeSmall organic molecule
Emp. Form.C25H23ClF3N3O3
Mol. Mass.505.917
SMILESFC(F)(F)C1N[C@@H](Cc2ccc(OC\C=C\COc3ccccc13)c(Cl)c2)C(=O)NC1(CC1)C#N