Reaction Details
TargetProcathepsin L
LigandBDBM50263578
Substrate/Competitorn/a
Meas. Tech.ChEBML_1698166
Ki 2.5±n/a nM
Citation Giroud, MDietzel, UAnselm, LBanner, DKuglstatter, ABenz, JBlanc, JBGaufreteau, DLiu, HLin, XStich, AKuhn, BSchuler, FKaiser, MBrun, RSchirmeister, TKisker, CDiederich, FHaap, W Repurposing a Library of Human Cathepsin L Ligands: Identification of Macrocyclic Lactams as Potent Rhodesain and Trypanosoma brucei Inhibitors. J Med Chem61:3350-3369 (2018) 
 
Procathepsin L
Name:Procathepsin L
Type:Enzyme
Mol. Mass.:37557.19
Organism:Homo sapiens (Human)
Description:Purchased from Calbiochem (San Diego, CA).
Residue:333
BDBM50263578
NameBDBM50263578
Synonyms:CHEMBL4064172
TypeSmall organic molecule
Emp. Form.C25H26ClN5O3
Mol. Mass.479.959
SMILESClc1cc2C[C@H](NC(=O)c3cc(C4CC4)n(CC\C=C\COc1cc2)n3)C(=O)NC1(CC1)C#N