Reaction Details
TargetProcathepsin L
LigandBDBM50263576
Substrate/Competitorn/a
Meas. Tech.ChEBML_1698166
Ki 56±n/a nM
Citation Giroud, MDietzel, UAnselm, LBanner, DKuglstatter, ABenz, JBlanc, JBGaufreteau, DLiu, HLin, XStich, AKuhn, BSchuler, FKaiser, MBrun, RSchirmeister, TKisker, CDiederich, FHaap, W Repurposing a Library of Human Cathepsin L Ligands: Identification of Macrocyclic Lactams as Potent Rhodesain and Trypanosoma brucei Inhibitors. J Med Chem61:3350-3369 (2018) 
 
Procathepsin L
Name:Procathepsin L
Type:Enzyme
Mol. Mass.:37557.19
Organism:Homo sapiens (Human)
Description:Purchased from Calbiochem (San Diego, CA).
Residue:333
BDBM50263576
NameBDBM50263576
Synonyms:CHEMBL4072767
TypeSmall organic molecule
Emp. Form.C28H26ClN5O3
Mol. Mass.515.991
SMILESClc1cc2C[C@H](NC(=O)c3cc(-c4ccccc4)n(CC\C=C\COc1cc2)n3)C(=O)NC1(CC1)C#N