Reaction Details
TargetProcathepsin L
LigandBDBM50263574
Substrate/Competitorn/a
Meas. Tech.ChEBML_1698166
Ki 4.6±n/a nM
Citation Giroud, MDietzel, UAnselm, LBanner, DKuglstatter, ABenz, JBlanc, JBGaufreteau, DLiu, HLin, XStich, AKuhn, BSchuler, FKaiser, MBrun, RSchirmeister, TKisker, CDiederich, FHaap, W Repurposing a Library of Human Cathepsin L Ligands: Identification of Macrocyclic Lactams as Potent Rhodesain and Trypanosoma brucei Inhibitors. J Med Chem61:3350-3369 (2018) 
 
Procathepsin L
Name:Procathepsin L
Type:Enzyme
Mol. Mass.:37557.19
Organism:Homo sapiens (Human)
Description:Purchased from Calbiochem (San Diego, CA).
Residue:333
BDBM50263574
NameBDBM50263574
Synonyms:CHEMBL4065847
TypeSmall organic molecule
Emp. Form.C25H24ClN3O7S
Mol. Mass.545.992
SMILES[H][C@@]12COc3ccc(C[C@H](NC(=O)c4cc(ccc4OC[C@@]1([H])O2)S(C)(=O)=O)C(=O)NC1(CC1)C#N)cc3Cl