Reaction Details
TargetCysteine protease
LigandBDBM50263573
Substrate/Competitorn/a
Meas. Tech.ChEBML_1698165
Ki 4.8±n/a nM
Citation Giroud, MDietzel, UAnselm, LBanner, DKuglstatter, ABenz, JBlanc, JBGaufreteau, DLiu, HLin, XStich, AKuhn, BSchuler, FKaiser, MBrun, RSchirmeister, TKisker, CDiederich, FHaap, W Repurposing a Library of Human Cathepsin L Ligands: Identification of Macrocyclic Lactams as Potent Rhodesain and Trypanosoma brucei Inhibitors. J Med Chem61:3350-3369 (2018) 
 
Cysteine protease
Name:Cysteine protease
Synonyms:Rhodesain
Type:PROTEIN
Mol. Mass.:48425.78
Organism:Trypanosoma brucei rhodesiense
Description:ChEMBL_619861
Residue:450
BDBM50263573
NameBDBM50263573
Synonyms:CHEMBL4080708
TypeSmall organic molecule
Emp. Form.C24H18ClF2N3O4
Mol. Mass.485.867
SMILESFc1cc(F)c2OCC#CCOc3ccc(C[C@H](NC(=O)c2c1)C(=O)NC1(CC1)C#N)cc3Cl