Reaction Details
TargetMelanocyte-stimulating hormone receptor
LigandBDBM50263813
Substrate/Competitorn/a
Meas. Tech.ChEMBL_1698288 (CHEMBL4049178)
Ki 490±n/a nM
Citation Durek, TCromm, PMWhite, AMSchroeder, CIKaas, QWeidmann, JAhmad Fuaad, ACheneval, OHarvey, PJDaly, NLZhou, YDellsén, AÖsterlund, TLarsson, NKnerr, LBauer, UKessler, HCai, MHruby, VJPlowright, ATCraik, DJ Development of Novel Melanocortin Receptor Agonists Based on the Cyclic Peptide Framework of Sunflower Trypsin Inhibitor-1. J Med Chem61:3674-3684 (2018) 
 
Melanocyte-stimulating hormone receptor
Name:Melanocyte-stimulating hormone receptor
Type:Enzyme
Mol. Mass.:34717.23
Organism:Homo sapiens (Human)
Description:Q01726
Residue:317
BDBM50263813
NameBDBM50263813
Synonyms:CHEMBL4063111
TypeSmall organic molecule
Emp. Form.C77H113N23O16S2
Mol. Mass.1680.996
SMILESCC[C@H](C)[C@@H]1NC(=O)[C@@H]2CCCN2C(=O)[C@@H]2CCCN2C(=O)[C@@H](NC(=O)[C@H](CO)NC(=O)[C@H](C)NC(=O)[C@@H](NC(=O)[C@@H]2CSSC[C@H](NC1=O)C(=O)N(C)[C@@H](Cc1cnc[nH]1)C(=O)N[C@H](Cc1ccccc1)C(=O)N[C@@H](CCCNC(N)=N)C(=O)N[C@@H](Cc1c[nH]c3ccccc13)C(=O)N[C@@H](CCCNC(N)=N)C(=O)N2)[C@H](C)O)[C@@H](C)CC