Reaction Details
TargetMelanocortin receptor 5
LigandBDBM50263830
Substrate/Competitorn/a
Meas. Tech.ChEMBL_1698291 (CHEMBL4049181)
IC50 16218±n/a nM
Citation Durek, TCromm, PMWhite, AMSchroeder, CIKaas, QWeidmann, JAhmad Fuaad, ACheneval, OHarvey, PJDaly, NLZhou, YDellsén, AÖsterlund, TLarsson, NKnerr, LBauer, UKessler, HCai, MHruby, VJPlowright, ATCraik, DJ Development of Novel Melanocortin Receptor Agonists Based on the Cyclic Peptide Framework of Sunflower Trypsin Inhibitor-1. J Med Chem61:3674-3684 (2018) 
 
Melanocortin receptor 5
Name:Melanocortin receptor 5
Type:Enzyme
Mol. Mass.:36612.92
Organism:Homo sapiens (Human)
Description:P33032
Residue:325
BDBM50263830
NameBDBM50263830
Synonyms:CHEMBL4064433
TypeSmall organic molecule
Emp. Form.C81H111N23O17S2
Mol. Mass.1743.022
SMILESCC[C@H](C)[C@@H]1NC(=O)[C@@H]2CCCN2C(=O)[C@H](Cc2c[nH]c3ccccc23)NC(=O)[C@H](CCCNC(N)=N)N(C)C(=O)[C@@H](Cc2ccccc2)NC(=O)[C@H](Cc2cnc[nH]2)N(C)C(=O)[C@@H](NC(=O)[C@@H]2CSSC[C@H](NC1=O)C(=O)N[C@@H](Cc1ccccc1)C(=O)N1CCC[C@H]1C(=O)N[C@@H](CC(O)=O)C(=O)NCC(=O)N[C@@H](CCCNC(N)=N)C(=O)N2)[C@@H](C)O