Reaction Details
TargetMelanocortin receptor 3
LigandBDBM50027084
Substrate/Competitorn/a
Meas. Tech.ChEMBL_1698289 (CHEMBL4049179)
Ki 17±n/a nM
Citation Durek, TCromm, PMWhite, AMSchroeder, CIKaas, QWeidmann, JAhmad Fuaad, ACheneval, OHarvey, PJDaly, NLZhou, YDellsén, AÖsterlund, TLarsson, NKnerr, LBauer, UKessler, HCai, MHruby, VJPlowright, ATCraik, DJ Development of Novel Melanocortin Receptor Agonists Based on the Cyclic Peptide Framework of Sunflower Trypsin Inhibitor-1. J Med Chem61:3674-3684 (2018) 
 
Melanocortin receptor 3
Name:Melanocortin receptor 3
Type:Enzyme
Mol. Mass.:36044.86
Organism:Homo sapiens (Human)
Description:P41968
Residue:323
BDBM50027084
NameBDBM50027084
Synonyms:Melatonan
TypeSmall organic molecule
Emp. Form.C50H69N15O9
Mol. Mass.1024.178
SMILESCCCC[C@H](NC(C)=O)C(=O)N[C@H]1CC(=O)NCCCC[C@H](NC(=O)[C@H](Cc2c[nH]c3ccccc23)NC(=O)[C@H](CCCNC(N)=N)NC(=O)[C@@H](Cc2ccccc2)NC(=O)[C@H](Cc2cnc[nH]2)NC1=O)C(N)=O