Reaction Details
TargetMelanocortin receptor 4
LigandBDBM50263842
Substrate/Competitorn/a
Meas. Tech.ChEMBL_1698300 (CHEMBL4049190)
EC50 468±n/a nM
Citation Durek, TCromm, PMWhite, AMSchroeder, CIKaas, QWeidmann, JAhmad Fuaad, ACheneval, OHarvey, PJDaly, NLZhou, YDellsén, AÖsterlund, TLarsson, NKnerr, LBauer, UKessler, HCai, MHruby, VJPlowright, ATCraik, DJ Development of Novel Melanocortin Receptor Agonists Based on the Cyclic Peptide Framework of Sunflower Trypsin Inhibitor-1. J Med Chem61:3674-3684 (2018) 
 
Melanocortin receptor 4
Name:Melanocortin receptor 4
Type:Enzyme
Mol. Mass.:36949.50
Organism:Homo sapiens (Human)
Description:P32245
Residue:332
BDBM50263842
NameBDBM50263842
Synonyms:CHEMBL4099889
TypeSmall organic molecule
Emp. Form.C80H109N23O17S2
Mol. Mass.1728.995
SMILESCC[C@H](C)[C@@H]1NC(=O)[C@@H]2CCCN2C(=O)[C@H](Cc2c[nH]c3ccccc23)N(C)C(=O)[C@H](CCCNC(N)=N)NC(=O)[C@@H](Cc2ccccc2)NC(=O)[C@H](Cc2cnc[nH]2)NC(=O)[C@@H](NC(=O)[C@@H]2CSSC[C@H](NC1=O)C(=O)N[C@@H](Cc1ccccc1)C(=O)N1CCC[C@H]1C(=O)N[C@@H](CC(O)=O)C(=O)NCC(=O)N[C@@H](CCCNC(N)=N)C(=O)N2)[C@@H](C)O