Reaction Details
TargetAtypical chemokine receptor 3
LigandBDBM50264279
Substrate/Competitorn/a
Meas. Tech.ChEMBL_1698432 (CHEMBL4049322)
Ki 12.6±n/a nM
Citation Menhaji-Klotz, EHesp, KDLondregan, ATKalgutkar, ASPiotrowski, DWBoehm, MSong, KRyder, TBeaumont, KJones, RMAtkinson, KBrown, JALitchfield, JXiao, JCanterbury, DPBurford, KThuma, BALimberakis, CJiao, WBagley, SWAgarwal, SCrowell, DPazdziorko, SWard, JPrice, DAClerin, V Discovery of a Novel Small-Molecule Modulator of C-X-C Chemokine Receptor Type 7 as a Treatment for Cardiac Fibrosis. J Med Chem61:3685-3696 (2018) 
 
Atypical chemokine receptor 3
Name:Atypical chemokine receptor 3
Type:Enzyme
Mol. Mass.:41498.84
Organism:Homo sapiens (Human)
Description:P25106
Residue:362
BDBM50264279
NameBDBM50264279
Synonyms:CHEMBL4072602
TypeSmall organic molecule
Emp. Form.C27H39N5O2
Mol. Mass.465.6309
SMILES[H][C@@]12CC[C@@]([H])(O1)[C@H](C2)C(=O)N1CCC(CN2CCCN(CC2)c2c(CC)ccn3ccnc23)CC1