Reaction Details
TargetAtypical chemokine receptor 3
LigandBDBM50264304
Substrate/Competitorn/a
Meas. Tech.ChEMBL_1698432 (CHEMBL4049322)
Ki 50±n/a nM
Citation Menhaji-Klotz, EHesp, KDLondregan, ATKalgutkar, ASPiotrowski, DWBoehm, MSong, KRyder, TBeaumont, KJones, RMAtkinson, KBrown, JALitchfield, JXiao, JCanterbury, DPBurford, KThuma, BALimberakis, CJiao, WBagley, SWAgarwal, SCrowell, DPazdziorko, SWard, JPrice, DAClerin, V Discovery of a Novel Small-Molecule Modulator of C-X-C Chemokine Receptor Type 7 as a Treatment for Cardiac Fibrosis. J Med Chem61:3685-3696 (2018) 
 
Atypical chemokine receptor 3
Name:Atypical chemokine receptor 3
Type:Enzyme
Mol. Mass.:41498.84
Organism:Homo sapiens (Human)
Description:P25106
Residue:362
BDBM50264304
NameBDBM50264304
Synonyms:CHEMBL4105264
TypeSmall organic molecule
Emp. Form.C23H25N5OS
Mol. Mass.419.543
SMILESCOc1ccn2ccnc2c1N1CCCN(Cc2csc(n2)-c2ccccc2)CC1