Reaction Details
TargetReceptor tyrosine-protein kinase erbB-2
LigandBDBM50054654
Substrate/Competitorn/a
Meas. Tech.ChEMBL_1699478 (CHEMBL4050460)
IC50 8.1±n/a nM
Citation Wang, ALi, XWu, HZou, FYan, XEChen, CHu, CYu, KWang, WZhao, PWu, JQi, ZWang, WWang, BWang, LRen, TZhang, SYun, CHLiu, JLiu, Q Discovery of (R)-1-(3-(4-Amino-3-(3-chloro-4-(pyridin-2-ylmethoxy)phenyl)-1H-pyrazolo[3,4-d]pyrimidin-1-yl)piperidin-1-yl)prop-2-en-1-one (CHMFL-EGFR-202) as a Novel Irreversible EGFR Mutant Kinase Inhibitor with a Distinct Binding Mode. J Med Chem60:2944-2962 (2017) 
 
Receptor tyrosine-protein kinase erbB-2
Name:Receptor tyrosine-protein kinase erbB-2
Type:n/a
Mol. Mass.:137894.47
Organism:Homo sapiens (Human)
Description:P04626
Residue:1255
BDBM50054654
NameBDBM50054654
Synonyms:CHEMBL4068839
TypeSmall organic molecule
Emp. Form.C25H24ClN7O2
Mol. Mass.489.957
SMILESNc1ncnc2n(nc(-c3ccc(OCc4ccccn4)c(Cl)c3)c12)[C@@H]1CCCN(C1)C(=O)C=C