Reaction Details
TargetSerine/threonine-protein kinase pim-3
LigandBDBM50266629
Substrate/Competitorn/a
Meas. Tech.ChEMBL_1701139 (CHEMBL4052121)
Ki 0.400000±n/a nM
Citation Wang, XKolesnikov, ATay, SChan, GChao, QDo, SDrummond, JEbens, AJLiu, NLy, JHarstad, EHu, HMoffat, JMunugalavadla, VMurray, JSlaga, DTsui, VVolgraf, MWallweber, HChang, JH Discovery of 5-Azaindazole (GNE-955) as a Potent Pan-Pim Inhibitor with Optimized Bioavailability. J Med Chem60:4458-4473 (2017) 
 
Serine/threonine-protein kinase pim-3
Name:Serine/threonine-protein kinase pim-3
Type:Protein
Mol. Mass.:35888.19
Organism:Homo sapiens (Human)
Description:Q86V86
Residue:326
BDBM50266629
NameBDBM50266629
Synonyms:CHEMBL4061456
TypeSmall organic molecule
Emp. Form.C21H22N8
Mol. Mass.386.453
SMILESCc1cncc(n1)-c1cn2c(ncc2cn1)-c1cccc(n1)N1CCCNCC1