Reaction Details
TargetSerine/threonine-protein kinase pim-3
LigandBDBM50266631
Substrate/Competitorn/a
Meas. Tech.ChEMBL_1701139 (CHEMBL4052121)
Ki 0.020000±n/a nM
Citation Wang, XKolesnikov, ATay, SChan, GChao, QDo, SDrummond, JEbens, AJLiu, NLy, JHarstad, EHu, HMoffat, JMunugalavadla, VMurray, JSlaga, DTsui, VVolgraf, MWallweber, HChang, JH Discovery of 5-Azaindazole (GNE-955) as a Potent Pan-Pim Inhibitor with Optimized Bioavailability. J Med Chem60:4458-4473 (2017) 
 
Serine/threonine-protein kinase pim-3
Name:Serine/threonine-protein kinase pim-3
Type:Protein
Mol. Mass.:35888.19
Organism:Homo sapiens (Human)
Description:Q86V86
Residue:326
BDBM50266631
NameBDBM50266631
Synonyms:CHEMBL4076913
TypeSmall organic molecule
Emp. Form.C21H19F2N7
Mol. Mass.407.4193
SMILESCc1cncc(n1)-c1cc2n(ncc2cn1)-c1cccc(n1)[C@H]1CNCCC1(F)F