Reaction Details
TargetSerine/threonine-protein kinase pim-2
LigandBDBM50266626
Substrate/Competitorn/a
Meas. Tech.ChEMBL_1701138 (CHEMBL4052120)
Ki 0.480000±n/a nM
Citation Wang, XKolesnikov, ATay, SChan, GChao, QDo, SDrummond, JEbens, AJLiu, NLy, JHarstad, EHu, HMoffat, JMunugalavadla, VMurray, JSlaga, DTsui, VVolgraf, MWallweber, HChang, JH Discovery of 5-Azaindazole (GNE-955) as a Potent Pan-Pim Inhibitor with Optimized Bioavailability. J Med Chem60:4458-4473 (2017) 
 
Serine/threonine-protein kinase pim-2
Name:Serine/threonine-protein kinase pim-2
Type:Serine/threonine-protein kinase
Mol. Mass.:34185.93
Organism:Homo sapiens (Human)
Description:Q9P1W9
Residue:311
BDBM50266626
NameBDBM50266626
Synonyms:CHEMBL4091687
TypeSmall organic molecule
Emp. Form.C20H21N9
Mol. Mass.387.441
SMILESCc1cncc(n1)-c1cc2n(ncc2nn1)-c1cccc(n1)N1CCCNCC1