Reaction Details
TargetSerine/threonine-protein kinase pim-3
LigandBDBM248955
Substrate/Competitorn/a
Meas. Tech.ChEMBL_1701139 (CHEMBL4052121)
Ki 0.008000±n/a nM
Citation Wang, XKolesnikov, ATay, SChan, GChao, QDo, SDrummond, JEbens, AJLiu, NLy, JHarstad, EHu, HMoffat, JMunugalavadla, VMurray, JSlaga, DTsui, VVolgraf, MWallweber, HChang, JH Discovery of 5-Azaindazole (GNE-955) as a Potent Pan-Pim Inhibitor with Optimized Bioavailability. J Med Chem60:4458-4473 (2017) 
 
Serine/threonine-protein kinase pim-3
Name:Serine/threonine-protein kinase pim-3
Type:Protein
Mol. Mass.:35888.19
Organism:Homo sapiens (Human)
Description:Q86V86
Residue:326
BDBM248955
NameBDBM248955
Synonyms:US9434725, 186
TypeSmall organic molecule
Emp. Form.C22H24N8O
Mol. Mass.416.479
SMILESCOc1ccc(nc1N1CCC[C@H](N)C1)-n1ncc2cnc(cc12)-c1cncc(C)n1