Reaction Details
TargetAdenosine receptor A3
LigandBDBM50266652
Substrate/Competitorn/a
Meas. Tech.ChEMBL_1701167 (CHEMBL4052149)
Ki 0.532000±n/a nM
Citation Petrelli, RScortichini, MKachler, SBoccella, SCerchia, CTorquati, IDel Bello, FSalvemini, DNovellino, ELuongo, LMaione, SJacobson, KALavecchia, AKlotz, KNCappellacci, L Exploring the Role of N J Med Chem60:4327-4341 (2017) 
 
Adenosine receptor A3
Name:Adenosine receptor A3
Type:G Protein-Coupled Receptor (GPCR)
Mol. Mass.:36197.32
Organism:Homo sapiens (Human)
Description:P0DMS8
Residue:318
BDBM50266652
NameBDBM50266652
Synonyms:CHEMBL4078479
TypeSmall organic molecule
Emp. Form.C19H20IN9O3
Mol. Mass.549.3251
SMILESCCn1nnc(n1)[C@H]1O[C@H]([C@H](O)[C@@H]1O)n1cnc2c(NCc3cccc(I)c3)ncnc12