Reaction Details
TargetAdenosine receptor A3
LigandBDBM50078422
Substrate/Competitorn/a
Meas. Tech.ChEMBL_1701162 (CHEMBL4052144)
Ki 228±n/a nM
Citation Petrelli, RScortichini, MKachler, SBoccella, SCerchia, CTorquati, IDel Bello, FSalvemini, DNovellino, ELuongo, LMaione, SJacobson, KALavecchia, AKlotz, KNCappellacci, L Exploring the Role of N J Med Chem60:4327-4341 (2017) 
 
Adenosine receptor A3
Name:Adenosine receptor A3
Type:PROTEIN
Mol. Mass.:36643.73
Organism:Rattus norvegicus
Description:ChEMBL_479910
Residue:320
BDBM50078422
NameBDBM50078422
Synonyms:CHEMBL3414936
TypeSmall organic molecule
Emp. Form.C12H15N9O3
Mol. Mass.333.306
SMILESCCn1nnc(n1)[C@H]1O[C@H]([C@H](O)[C@@H]1O)n1cnc2c(N)ncnc12