Reaction Details
TargetMelanocortin receptor 4
LigandBDBM50266713
Substrate/Competitorn/a
Meas. Tech.ChEMBL_1701213 (CHEMBL4052195)
Ki 126±n/a nM
Citation Doering, SRFreeman, KTSchnell, SMHaslach, EMDirain, MDebevec, GGeer, PSantos, RGGiulianotti, MAPinilla, CAppel, JRSpeth, RCHoughten, RAHaskell-Luevano, C Discovery of Mixed Pharmacology Melanocortin-3 Agonists and Melanocortin-4 Receptor Tetrapeptide Antagonist Compounds (TACOs) Based on the Sequence Ac-Xaa J Med Chem60:4342-4357 (2017) 
 
Melanocortin receptor 4
Name:Melanocortin receptor 4
Type:PROTEIN
Mol. Mass.:36964.43
Organism:Mus musculus
Description:ChEMBL_1498850
Residue:332
BDBM50266713
NameBDBM50266713
Synonyms:CHEMBL4089759
TypeSmall organic molecule
Emp. Form.C39H45IN8O5
Mol. Mass.832.7297
SMILESCC(=O)N[C@H](Cc1ccc2ccccc2c1)C(=O)N[C@@H](CCCNC(N)=N)C(=O)N[C@H](Cc1ccc(I)cc1)C(=O)N[C@@H](Cc1ccccc1)C(N)=O