Reaction Details
TargetMelanocortin receptor 3
LigandBDBM50034922
Substrate/Competitorn/a
Meas. Tech.ChEMBL_1701207 (CHEMBL4052189)
EC50 73±n/a nM
Citation Doering, SRFreeman, KTSchnell, SMHaslach, EMDirain, MDebevec, GGeer, PSantos, RGGiulianotti, MAPinilla, CAppel, JRSpeth, RCHoughten, RAHaskell-Luevano, C Discovery of Mixed Pharmacology Melanocortin-3 Agonists and Melanocortin-4 Receptor Tetrapeptide Antagonist Compounds (TACOs) Based on the Sequence Ac-Xaa J Med Chem60:4342-4357 (2017) 
 
Melanocortin receptor 3
Name:Melanocortin receptor 3
Type:PROTEIN
Mol. Mass.:35808.24
Organism:Mus musculus
Description:ChEMBL_1498848
Residue:323
BDBM50034922
NameBDBM50034922
Synonyms:(S)-2-{(R)-2-[(S)-2-Acetylamino-3-(1H-imidazol-4-yl)-propionylamino]-3-phenyl-propionylamino}-5-guanidino-pentanoic acid [(S)-1-carbamoyl-2-(1H-indol-3-yl)-ethyl]-amide 1N-[1-carbamoyl-2-(1H-3-indolyl)-(1S)-ethyl]-5-amino(imino)methylamino-2-[1-[2-(1H-5-imidazolyl)-1-methylcarboxamido-(1S)-ethylcarboxamido]-2-phenyl-(1R)-ethylcarboxamido]-(2S)-pentanamide Ac-His-DPhe-Arg-Trp-NH2 | CHEMBL264190
TypeSmall organic molecule
Emp. Form.C34H43N11O5
Mol. Mass.685.7759
SMILESCC(=O)N[C@@H](Cc1cnc[nH]1)C(=O)N[C@H](Cc1ccccc1)C(=O)N[C@@H](CCCN=C(N)N)C(=O)N[C@@H](Cc1c[nH]c2ccccc12)C(N)=O