Reaction Details
TargetMelanocortin receptor 4
LigandBDBM50266704
Substrate/Competitorn/a
Meas. Tech.ChEMBL_1701206 (CHEMBL4052188)
IC50 13±n/a nM
Citation Doering, SRFreeman, KTSchnell, SMHaslach, EMDirain, MDebevec, GGeer, PSantos, RGGiulianotti, MAPinilla, CAppel, JRSpeth, RCHoughten, RAHaskell-Luevano, C Discovery of Mixed Pharmacology Melanocortin-3 Agonists and Melanocortin-4 Receptor Tetrapeptide Antagonist Compounds (TACOs) Based on the Sequence Ac-Xaa J Med Chem60:4342-4357 (2017) 
 
Melanocortin receptor 4
Name:Melanocortin receptor 4
Type:PROTEIN
Mol. Mass.:36964.43
Organism:Mus musculus
Description:ChEMBL_1498850
Residue:332
BDBM50266704
NameBDBM50266704
Synonyms:CHEMBL4083717
TypeSmall organic molecule
Emp. Form.C33H46IN11O5
Mol. Mass.803.6935
SMILESCC(=O)N[C@@H](CCCNC(N)=N)C(=O)N[C@@H](CCCNC(N)=N)C(=O)N[C@H](Cc1ccc(I)cc1)C(=O)N1Cc2ccccc2C[C@H]1C(N)=O