Reaction Details
TargetLysyl oxidase homolog 2
LigandBDBM50266837
Substrate/Competitorn/a
Meas. Tech.ChEMBL_1701347 (CHEMBL4052329)
IC50 77±n/a nM
Citation Rowbottom, MWBain, GCalderon, ILasof, TLonergan, DLai, AHuang, FDarlington, JProdanovich, PSantini, AMKing, CDGoulet, LShannon, KEMa, GLNguyen, KMacKenna, DAEvans, JFHutchinson, JH Identification of 4-(Aminomethyl)-6-(trifluoromethyl)-2-(phenoxy)pyridine Derivatives as Potent, Selective, and Orally Efficacious Inhibitors of the Copper-Dependent Amine Oxidase, Lysyl Oxidase-Like 2 (LOXL2). J Med Chem60:4403-4423 (2017) 
 
Lysyl oxidase homolog 2
Name:Lysyl oxidase homolog 2
Type:PROTEIN
Mol. Mass.:86721.38
Organism:Homo sapiens (Human)
Description:ChEMBL_115990
Residue:774
BDBM50266837
NameBDBM50266837
Synonyms:CHEMBL4100783
TypeSmall organic molecule
Emp. Form.C17H19ClF3N3O4
Mol. Mass.421.799
SMILESCl.NCc1cc(Oc2cccc(c2)C(=O)NC[C@@H](O)CO)nc(c1)C(F)(F)F