Reaction Details
TargetMitogen-activated protein kinase kinase kinase 20
LigandBDBM50268011
Substrate/Competitorn/a
Meas. Tech.ChEBML_1704329
IC50 17±n/a nM
Citation Chang, YLu, XShibu, MADai, YBLuo, JZhang, YLi, YZhao, PZhang, ZXu, YTu, ZCZhang, QWYun, CHHuang, CYDing, K Structure Based Design of N-(3-((1H-Pyrazolo[3,4-b]pyridin-5-yl)ethynyl)benzenesulfonamides as Selective Leucine-Zipper and Sterile-? Motif Kinase (ZAK) Inhibitors. J Med Chem60:5927-5932 (2017) 
 
Mitogen-activated protein kinase kinase kinase 20
Name:Mitogen-activated protein kinase kinase kinase 20
Type:PROTEIN
Mol. Mass.:91168.58
Organism:Homo sapiens (Human)
Description:ChEMBL_1495629
Residue:800
BDBM50268011
NameBDBM50268011
Synonyms:CHEMBL4069195
TypeSmall organic molecule
Emp. Form.C21H13ClF2N4O3S
Mol. Mass.474.868
SMILESCOc1n[nH]c2ncc(cc12)C#Cc1c(F)ccc(NS(=O)(=O)c2ccc(Cl)cc2)c1F