Reaction Details
TargetMitogen-activated protein kinase kinase kinase 20
LigandBDBM50268023
Substrate/Competitorn/a
Meas. Tech.ChEMBL_1704329 (CHEMBL4055562)
IC50 144±n/a nM
Citation Chang, YLu, XShibu, MADai, YBLuo, JZhang, YLi, YZhao, PZhang, ZXu, YTu, ZCZhang, QWYun, CHHuang, CYDing, K Structure Based Design of N-(3-((1H-Pyrazolo[3,4-b]pyridin-5-yl)ethynyl)benzenesulfonamides as Selective Leucine-Zipper and Sterile-? Motif Kinase (ZAK) Inhibitors. J Med Chem60:5927-5932 (2017) 
 
Mitogen-activated protein kinase kinase kinase 20
Name:Mitogen-activated protein kinase kinase kinase 20
Type:PROTEIN
Mol. Mass.:91168.58
Organism:Homo sapiens (Human)
Description:ChEMBL_1495629
Residue:800
BDBM50268023
NameBDBM50268023
Synonyms:CHEMBL4078038
TypeSmall organic molecule
Emp. Form.C25H19ClF2N4O3S
Mol. Mass.528.958
SMILESFc1ccc(NS(=O)(=O)c2cccc(Cl)c2)c(F)c1C#Cc1cnc2[nH]nc(OC3CCCC3)c2c1